Skip to content

Bump to Netty 4.1.106.Final

quarkus-bot / Build summary for f9c960a44d513ba8fdf729174c5f89283ce3e500 completed Jan 23, 2024

Build summary for f9c960a44d513ba8fdf729174c5f89283ce3e500

Failing Jobs - Building f9c960a - Back to Pull request

Status Name Step Failures Logs Raw logs Build scan
βœ”οΈ Maven Tests - JDK 17 🚧
βœ– Maven Tests - JDK 17 Windows Build Failures Logs Raw logs 🚧

Details

Test Failures

βš™οΈ Maven Tests - JDK 17 Windows #

- Failing: integration-tests/maven 

πŸ“¦ integration-tests/maven

# Tests:    11
+ Success:  10
- Failures: 0
- Errors:   1
! Skipped:  0

βœ– io.quarkus.maven.it.TestMojoIT.testThatTheTestsAreReRunMultiModule - Source on GitHub - πŸ …

org.awaitility.core.ConditionTimeoutException: Condition with io.quarkus.maven.it.continuoustesting.TestModeContinuousTestingMavenTestUtils was not fulfilled within 3 minutes.
	at org.awaitility.core.ConditionAwaiter.await(ConditionAwaiter.java:167)
	at org.awaitility.core.CallableCondition.await(CallableCondition.java:78)
	at org.awaitility.core.CallableCondition.await(CallableCondition.java:26)
	at org.awaitility.core.ConditionFactory.until(ConditionFactory.java:985)
	at org.awaitility.core.ConditionFactory.until(ConditionFactory.java:954)
	at io.quarkus.maven.it.continuoustesting.TestModeContinuousTestingMavenTestUtils.waitForNextCompletion(TestModeContinuousTestingMavenTestUtils.java:49)
	at io.quarkus.maven.it.LaunchMojoTestBase.testThatTheTestsAreReRunMultiModule(LaunchMojoTestBase.java:56)

Annotations

Check failure on line 1 in integration-tests/maven/src/test/java/io/quarkus/maven/it/TestMojoIT.java

@quarkus-bot quarkus-bot / Build summary for f9c960a44d513ba8fdf729174c5f89283ce3e500

Maven Tests - JDK 17 Windows

org.awaitility.core.ConditionTimeoutException: Condition with io.quarkus.maven.it.continuoustesting.TestModeContinuousTestingMavenTestUtils was not fulfilled within 3 minutes.
	at org.awaitility.core.ConditionAwaiter.await(ConditionAwaiter.java:167)
	at org.awaitility.core.CallableCondition.await(CallableCondition.java:78)
Raw output
org.awaitility.core.ConditionTimeoutException: Condition with io.quarkus.maven.it.continuoustesting.TestModeContinuousTestingMavenTestUtils was not fulfilled within 3 minutes.
	at org.awaitility.core.ConditionAwaiter.await(ConditionAwaiter.java:167)
	at org.awaitility.core.CallableCondition.await(CallableCondition.java:78)
	at org.awaitility.core.CallableCondition.await(CallableCondition.java:26)
	at org.awaitility.core.ConditionFactory.until(ConditionFactory.java:985)
	at org.awaitility.core.ConditionFactory.until(ConditionFactory.java:954)
	at io.quarkus.maven.it.continuoustesting.TestModeContinuousTestingMavenTestUtils.waitForNextCompletion(TestModeContinuousTestingMavenTestUtils.java:49)
	at io.quarkus.maven.it.LaunchMojoTestBase.testThatTheTestsAreReRunMultiModule(LaunchMojoTestBase.java:56)
	at java.base/java.lang.reflect.Method.invoke(Method.java:568)
	at java.base/java.util.ArrayList.forEach(ArrayList.java:1511)
	at java.base/java.util.ArrayList.forEach(ArrayList.java:1511)